Target
Cytochrome P450 2D6
Ligand
BDBM50177527
Substrate
Meas. Tech.
ChEMBL_334181 (CHEMBL866475)
IC50
900±n/a nM
Citation
 Berlin, MTing, PCVaccaro, WDAslanian, RMcCormick, KDLee, JFAlbanese, MMMutahi, MWPiwinski, JJShih, NYDuguma, LSolomon, DMZhou, WSher, RFavreau, LBryant, MKorfmacher, WANardo, CWest, REAnthes, JCWilliams, SMWu, RLSusan She, HRivelli, MACorboz, MRHey, JA Reduction of CYP450 inhibition in the 4-[(1H-imidazol-4-yl)methyl]piperidine series of histamine H3 receptor antagonists. Bioorg Med Chem Lett 16:989-94 (2006)  
Target
Name:
Cytochrome P450 2D6
Synonyms:
CP2D6_HUMAN CYP2DL1 Cytochrome P450 2D6 (CYP2D6) P450-DB1
Type:
Protein
Mol. Mass.:
55774.82
Organism:
Homo sapiens (Human)
Description:
P10635
Residue:
497
  
Inhibitor
Name:
BDBM50177527
Synonyms:
4-(3-(4-((1H-imidazol-4-yl)methyl)piperidin-1-yl)propoxy)-N-cyclohexylbenzenamine | CHEMBL204951
Type:
Small organic molecule
Emp. Form.:
C24H36N4O
Mol. Mass.:
396.5688
SMILES:
C(COc1ccc(NC2CCCCC2)cc1)CN1CCC(Cc2cnc[nH]2)CC1
: