Target
Histamine H3 receptor
Ligand
BDBM50177546
Substrate
Meas. Tech.
ChEMBL_334179 (CHEMBL866473)
Ki
8±n/a nM
Citation
 Berlin, MTing, PCVaccaro, WDAslanian, RMcCormick, KDLee, JFAlbanese, MMMutahi, MWPiwinski, JJShih, NYDuguma, LSolomon, DMZhou, WSher, RFavreau, LBryant, MKorfmacher, WANardo, CWest, REAnthes, JCWilliams, SMWu, RLSusan She, HRivelli, MACorboz, MRHey, JA Reduction of CYP450 inhibition in the 4-[(1H-imidazol-4-yl)methyl]piperidine series of histamine H3 receptor antagonists. Bioorg Med Chem Lett 16:989-94 (2006)  
Target
Name:
Histamine H3 receptor
Synonyms:
HISTAMINE H3 HRH3_CAVPO | Histamine H3 receptor
Type:
Enzyme Catalytic Domain
Mol. Mass.:
48753.61
Organism:
GUINEA PIG
Description:
HISTAMINE H3 HRH3 GUINEA PIG::Q9JI35
Residue:
445
  
Inhibitor
Name:
BDBM50177546
Synonyms:
4-((1H-imidazol-4-yl)methyl)-N-(pyrimidin-2-yl)piperidine-1-carboxamide | CHEMBL378821
Type:
Small organic molecule
Emp. Form.:
C14H18N6O
Mol. Mass.:
286.3323
SMILES:
O=C(Nc1ncccn1)N1CCC(Cc2cnc[nH]2)CC1
: