Target
RNA-directed RNA polymerase
Ligand
BDBM50181942
Substrate
Meas. Tech.
ChEMBL_345618 (CHEMBL860683)
IC50
1200±n/a nM
Citation
 Ishida, TSuzuki, THirashima, SMizutani, KYoshida, AAndo, IIkeda, SAdachi, THashimoto, H Benzimidazole inhibitors of hepatitis C virus NS5B polymerase: identification of 2-[(4-diarylmethoxy)phenyl]-benzimidazole. Bioorg Med Chem Lett 16:1859-63 (2006)  
Target
Name:
RNA-directed RNA polymerase
Synonyms:
Hepatitis C virus NS5B RNA-dependent RNA polymerase | NS5B protein
Type:
Protein
Mol. Mass.:
25173.95
Organism:
Hepatitis C virus
Description:
Q8JXU8
Residue:
229
  
Inhibitor
Name:
BDBM50181942
Synonyms:
1-cyclohexyl-2-(4-(2-phenoxyethoxy)phenyl)-1H-benzo[d]imidazole-5-carboxylic acid | CHEMBL383468
Type:
Small organic molecule
Emp. Form.:
C28H28N2O4
Mol. Mass.:
456.5329
SMILES:
OC(=O)c1ccc2n(C3CCCCC3)c(nc2c1)-c1ccc(OCCOc2ccccc2)cc1
: