Target
DNA polymerase beta
Ligand
BDBM50181935
Substrate
Meas. Tech.
ChEMBL_345624 (CHEMBL859712)
IC50
>10000±n/a nM
Citation
 Ishida, TSuzuki, THirashima, SMizutani, KYoshida, AAndo, IIkeda, SAdachi, THashimoto, H Benzimidazole inhibitors of hepatitis C virus NS5B polymerase: identification of 2-[(4-diarylmethoxy)phenyl]-benzimidazole. Bioorg Med Chem Lett 16:1859-63 (2006)  
Target
Name:
DNA polymerase beta
Synonyms:
DNA polymerase beta (Pol β) POLB
Type:
Protein
Mol. Mass.:
38188.76
Organism:
Homo sapiens (Human)
Description:
Residue:
335
  
Inhibitor
Name:
BDBM50181935
Synonyms:
1-Cyclohexyl-2-[4-(di-pyridin-3-yl-methoxy)-2-fluoro-phenyl]-1H-benzoimidazole-5-carboxylic acid | CHEMBL383304
Type:
Small organic molecule
Emp. Form.:
C31H27FN4O3
Mol. Mass.:
522.5695
SMILES:
OC(=O)c1ccc2n(C3CCCCC3)c(nc2c1)-c1ccc(OC(c2cccnc2)c2cccnc2)cc1F
: