Target
C-C chemokine receptor type 5
Ligand
BDBM50184403
Substrate
Meas. Tech.
ChEMBL_338785 (CHEMBL859207)
IC50
1±n/a nM
Citation
 Seto, MAikawa, KMiyamoto, NAramaki, YKanzaki, NTakashima, KKuze, YIizawa, YBaba, MShiraishi, M Highly potent and orally active CCR5 antagonists as anti-HIV-1 agents: synthesis and biological activities of 1-benzazocine derivatives containing a sulfoxide moiety. J Med Chem 49:2037-48 (2006)  
Target
Name:
C-C chemokine receptor type 5
Synonyms:
C-C CKR-5 CC-CKR-5 CCR5 CCR5_HUMAN CHEMR13 HIV-1 fusion coreceptor
Type:
Enzyme
Mol. Mass.:
40540.21
Organism:
Homo sapiens (Human)
Description:
P51681
Residue:
352
  
Inhibitor
Name:
BDBM50184403
Synonyms:
7-(4-(2-butoxyethoxy)phenyl)-1-isobutyl-N-(4-((1-propyl-1H-imidazol-5-yl)methylsulfinyl)phenyl)-2,3-dihydro-1H-benzo[b]azepine-4-carboxamide | CHEMBL204821
Type:
Small organic molecule
Emp. Form.:
C40H50N4O4S
Mol. Mass.:
682.914
SMILES:
CCCCOCCOc1ccc(cc1)-c1ccc2N(CC(C)C)CCC(=Cc2c1)C(=O)Nc1ccc(cc1)S(=O)Cc1cncn1CCC
: