Target
Alpha-2A adrenergic receptor [16-465]
Ligand
BDBM50187381
Substrate
Meas. Tech.
ChEMBL_357749 (CHEMBL870838)
Ki
12±n/a nM
Citation
 Becker, OMDhanoa, DSMarantz, YChen, DShacham, SCheruku, SHeifetz, AMohanty, PFichman, MSharadendu, ANudelman, RKauffman, MNoiman, S An integrated in silico 3D model-driven discovery of a novel, potent, and selective amidosulfonamide 5-HT1A agonist (PRX-00023) for the treatment of anxiety and depression. J Med Chem 49:3116-35 (2006)  
Target
Name:
Alpha-2A adrenergic receptor [16-465]
Synonyms:
ADA2A_RAT Adrenaline 2 Alpha-2A adrenoceptor Alpha-2AAR Alpha2 Adrenoreceptor adrenergic Alpha2A
Type:
G-protein coupled receptor
Mol. Mass.:
48961.69
Organism:
Rattus norvegicus (rat)
Description:
P22909[16-465]
Residue:
450
  
Inhibitor
Name:
BDBM50187381
Synonyms:
CHEMBL209324 | N-(4-(4-(2-methoxyphenyl)piperazin-1-yl)butyl)-4-methylbenzenesulfonamide
Type:
Small organic molecule
Emp. Form.:
C22H31N3O3S
Mol. Mass.:
417.565
SMILES:
COc1ccccc1N1CCN(CCCCNS(=O)(=O)c2ccc(C)cc2)CC1
: