Target
Sodium- and chloride-dependent glycine transporter 1
Ligand
BDBM50187879
Substrate
Meas. Tech.
ChEMBL_387071 (CHEMBL862962)
IC50
7300±n/a nM
Citation
 Smith, GMikkelsen, GEskildsen, JBundgaard, C The synthesis and SAR of 2-arylsulfanylphenyl-1-oxyalkylamino acids as GlyT-1 inhibitors. Bioorg Med Chem Lett 16:3981-4 (2006)  
Target
Name:
Sodium- and chloride-dependent glycine transporter 1
Synonyms:
GlyT-1 Glycine Transporters (GlyT1c) SC6A9_HUMAN Sodium- and chloride-dependent glycine transporter 1 Sodium- and chloride-dependent glycine transporter 1 (GlyT1c) Solute carrier family 6 member 9
Type:
Enzyme
Mol. Mass.:
78270.54
Organism:
Homo sapiens (Human)
Description:
P48067
Residue:
706
  
Inhibitor
Name:
BDBM50187879
Synonyms:
2-((2-(2-(3-chlorophenylthio)phenoxy)ethyl)(ethyl)amino)acetic acid | CHEMBL378708
Type:
Small organic molecule
Emp. Form.:
C18H20ClNO3S
Mol. Mass.:
365.874
SMILES:
CCN(CCOc1ccccc1Sc1cccc(Cl)c1)CC(O)=O
: