Target
Galanin receptor type 3
Ligand
BDBM50187925
Substrate
Meas. Tech.
ChEMBL_384498 (CHEMBL866716)
Ki
8±n/a nM
Citation
 Konkel, MJPackiarajan, MChen, HTopiwala, UPJimenez, HTalisman, IJCoate, HWalker, MW Amino substituted analogs of 1-phenyl-3-phenylimino-2-indolones with potent galanin Gal3 receptor binding affinity and improved solubility. Bioorg Med Chem Lett 16:3950-4 (2006)  
Target
Name:
Galanin receptor type 3
Synonyms:
GALNR3 GALR3_HUMAN Galanin receptor 3 | Galanin receptor type 3
Type:
Enzyme Catalytic Domain
Mol. Mass.:
39599.97
Organism:
Homo sapiens (Human)
Description:
Galanin R3 GALR3 HUMAN::O60755
Residue:
368
  
Inhibitor
Name:
BDBM50187925
Synonyms:
1-(3-(2-(piperidin-1-yl)ethoxy)phenyl)-3-(3-(trifluoromethyl)phenylimino)indolin-2-one | CHEMBL209498
Type:
Small organic molecule
Emp. Form.:
C28H26F3N3O2
Mol. Mass.:
493.5201
SMILES:
FC(F)(F)c1cccc(c1)\N=C1\C(=O)N(c2ccccc12)c1cccc(OCCN2CCCCC2)c1
: