Target
Genome polyprotein
Ligand
BDBM50187934
Substrate
Meas. Tech.
ChEMBL_388024 (CHEMBL869782)
Ki
12±n/a nM
Citation
 Arasappan, ANjoroge, FGChen, KXVenkatraman, SParekh, TNGu, HPichardo, JButkiewicz, NProngay, AMadison, VGirijavallabhan, V P2-P4 macrocyclic inhibitors of hepatitis C virus NS3-4A serine protease. Bioorg Med Chem Lett 16:3960-5 (2006)  
Target
Name:
Genome polyprotein
Synonyms:
Hepatitis C virus NS3 protease/helicase | Hepatitis C virus serine protease, NS3/NS4A
Type:
Protein
Mol. Mass.:
67067.41
Organism:
Hepatitis C virus
Description:
A3EZI9
Residue:
631
  
Inhibitor
Name:
BDBM50187934
Synonyms:
(7R,9S,12S)-12-cyclohexyl-19-methyl-11,14-dioxo-2,6-dioxa-10,13-diaza-tricyclo[14.3.1.1*7,10*]henicosa-1(19),16(20),17-triene-9-carboxylic acid [1-((S)-dimethylcarbamoyl-phenyl-methyl)-carbamoyl]-methyl)-aminooxalyl)-butyl)-amide | CHEMBL426508
Type:
Small organic molecule
Emp. Form.:
C43H58N6O9
Mol. Mass.:
802.9554
SMILES:
CCCC(NC(=O)[C@@H]1C[C@@H]2CN1C(=O)[C@@H](NC(=O)Cc1ccc(C)c(OCCCO2)c1)C1CCCCC1)C(=O)C(=O)NCC(=O)N[C@H](C(=O)N(C)C)c1ccccc1
: