Target
Adenosine receptor A2a
Ligand
BDBM50190710
Substrate
Meas. Tech.
ChEMBL_369244 (CHEMBL864798)
Ki
23±n/a nM
Citation
 Yan, LBertarelli, DCHayallah, AMMeyer, HKlotz, KNMüller, CE A new synthesis of sulfonamides by aminolysis of p-nitrophenylsulfonates yielding potent and selective adenosine A2B receptor antagonists. J Med Chem 49:4384-91 (2006)  
Target
Name:
Adenosine receptor A2a
Synonyms:
AA2AR_RAT Adenosine A2 receptor Adenosine Receptors A2a (A2a) Adenosine receptors A2a Rat striatal adenosine A2a receptor
Type:
G Protein-Coupled Receptor (GPCR)
Mol. Mass.:
45015.65
Organism:
Rattus norvegicus (rat)
Description:
Rat A2A receptors expressed in CHO cells.
Residue:
410
  
Inhibitor
Name:
BDBM50190710
Synonyms:
8-[4-(phenylamidosulfonyl)phenyl]-1-propylxanthine | CHEMBL209366
Type:
Small organic molecule
Emp. Form.:
C20H19N5O4S
Mol. Mass.:
425.461
SMILES:
CCCn1c(=O)[nH]c2nc([nH]c2c1=O)-c1ccc(cc1)S(=O)(=O)Nc1ccccc1
: