Target
Metabotropic glutamate receptor 8
Ligand
BDBM50060137
Substrate
Meas. Tech.
ChEMBL_400292 (CHEMBL912665)
EC50
10100±n/a nM
Citation
 Schann, SMenet, CArvault, PMercier, GFrauli, MMayer, SHubert, NTriballeau, NBertrand, HOAcher, FNeuville, P Design and synthesis of APTCs (aminopyrrolidinetricarboxylic acids): identification of a new group III metabotropic glutamate receptor selective agonist. Bioorg Med Chem Lett 16:4856-60 (2006)  
Target
Name:
Metabotropic glutamate receptor 8
Synonyms:
GRM8_RAT Grm8 Metabotropic glutamate receptor 8 (mGlu8) glutamate receptor, metabotropic 8 precursor metabotropic glutamate 8
Type:
Enzyme
Mol. Mass.:
101886.18
Organism:
Rattus norvegicus (Rat)
Description:
P70579
Residue:
908
  
Inhibitor
Name:
BDBM50060137
Synonyms:
(1R,2S)-4-aminocyclopentane-1,2,4-tricarboxylic acid (1S,2R,4S)-4-Amino-cyclopentane-1,2,4-tricarboxylic acid 4-Amino-cyclopentane-1,2,4-tricarboxylic acid | CHEMBL285043
Type:
Small organic molecule
Emp. Form.:
C8H11NO6
Mol. Mass.:
217.176
SMILES:
N[C@]1(C[C@@H]([C@@H](C1)C(O)=O)C(O)=O)C(O)=O
: