Target
Peroxisome proliferator-activated receptor gamma
Ligand
BDBM50191605
Substrate
Meas. Tech.
ChEMBL_376271 (CHEMBL854480)
EC50
300±n/a nM
Citation
 Ahn, JHShin, MSJung, SHKang, SKKim, KRRhee, SDJung, WHYang, SDKim, SJWoo, JRLee, JHCheon, HGKim, SS Indenone derivatives: a novel template for peroxisome proliferator-activated receptor gamma (PPARgamma) agonists. J Med Chem 49:4781-4 (2006)  
Target
Name:
Peroxisome proliferator-activated receptor gamma
Synonyms:
NR1C3 PPAR-gamma PPARG_HUMAN Peroxisome proliferator-activated receptor gamma (PPAR gamma) Peroxisome proliferator-activated receptor gamma (PPARĪ³) peroxisome proliferator-activated receptor gamma isoform 2
Type:
Nuclear Receptor
Mol. Mass.:
57613.46
Organism:
Homo sapiens (Human)
Description:
P37231
Residue:
505
  
Inhibitor
Name:
BDBM50191605
Synonyms:
6-methoxy-1-oxo-3-phenyl-1H-indene-2-carboxylic acid ethyl ester | CHEMBL213547
Type:
Small organic molecule
Emp. Form.:
C19H16O4
Mol. Mass.:
308.3279
SMILES:
CCOC(=O)C1=C(c2ccc(OC)cc2C1=O)c1ccccc1
: