Target
Melanin-concentrating hormone receptor 1
Ligand
BDBM50193681
Substrate
Meas. Tech.
ChEMBL_421374 (CHEMBL856556)
EC50
140±n/a nM
Citation
 Jiang, JHoang, MYoung, JRChaung, DEid, RTurner, CLin, PTong, XWang, JTan, CFeighner, SPalyha, OHreniuk, DLPan, JSailer, AWMacNeil, DJHoward, AShearman, LStribling, SCamacho, RStrack, AVan der Ploeg, LHGoulet, MTDeVita, RJ 2-Aminoquinoline melanin-concentrating hormone (MCH)1R antagonists. Bioorg Med Chem Lett 16:5270-4 (2006)  
Target
Name:
Melanin-concentrating hormone receptor 1
Synonyms:
G-protein coupled receptor 24 MCH receptor 1 MCH-R1 MCHR MCHR1_RAT Melanin Concentrating Hormone 1 Melanin-concentrating hormone receptor 1 Slc1 | Somatostatin receptor-like protein
Type:
Enzyme Catalytic Domain
Mol. Mass.:
39075.64
Organism:
RAT
Description:
Melanin Concentrating Hormone 1 GPR24 RAT::P97639
Residue:
353
  
Inhibitor
Name:
BDBM50193681
Synonyms:
CHEMBL215648 | N-(2-(isopropyl(methyl)amino)quinolin-6-yl)-3-(4-(trifluoromethyl)phenyl)propanamide
Type:
Small organic molecule
Emp. Form.:
C23H24F3N3O
Mol. Mass.:
415.4514
SMILES:
CC(C)N(C)c1ccc2cc(NC(=O)CCc3ccc(cc3)C(F)(F)F)ccc2n1
: