Target
11-beta-hydroxysteroid dehydrogenase type 2
Ligand
BDBM50195495
Substrate
Meas. Tech.
ChEMBL_425008 (CHEMBL911428)
IC50
>10000±n/a nM
Citation
 Richards, SSorensen, BJae, HSWinn, MChen, YWang, JFung, SMonzon, KFrevert, EUJacobson, PSham, HLink, JT Discovery of potent and selective inhibitors of 11beta-HSD1 for the treatment of metabolic syndrome. Bioorg Med Chem Lett 16:6241-5 (2006)  
Target
Name:
11-beta-hydroxysteroid dehydrogenase type 2
Synonyms:
11-beta-hydroxysteroid dehydrogenase 2 Hsd11b2 | Hsd11k
Type:
PROTEIN
Mol. Mass.:
43740.05
Organism:
Rattus norvegicus
Description:
ChEMBL_735659
Residue:
400
  
Inhibitor
Name:
BDBM50195495
Synonyms:
3-((2R,6R)-1-(4-amino-3,5-dichlorobenzoyl)-2,6-dimethylpiperidin-4-yl)benzo[d]oxazol-2(3H)-one | CHEMBL435136
Type:
Small organic molecule
Emp. Form.:
C21H21Cl2N3O3
Mol. Mass.:
434.316
SMILES:
C[C@@H]1CC(C[C@@H](C)N1C(=O)c1cc(Cl)c(N)c(Cl)c1)n1c2ccccc2oc1=O
: