Target
Beta-secretase 1
Ligand
BDBM50196731
Substrate
Meas. Tech.
ChEMBL_440731 (CHEMBL889828)
IC50
10±n/a nM
Citation
 Freskos, JNFobian, YMBenson, TEMoon, JBBienkowski, MJBrown, DLEmmons, TLHeintz, RLaborde, AMcDonald, JJMischke, BVMolyneaux, JMMullins, PBBryan Prince, DPaddock, DJTomasselli, AGWinterrowd, G Design of potent inhibitors of human beta-secretase. Part 2. Bioorg Med Chem Lett 17:78-81 (2006)  
Target
Name:
Beta-secretase 1
Synonyms:
ASP2 Aspartyl protease 2 BACE1 Beta-secretase (BACE) Beta-secretase 1 (BACE 1) Beta-secretase 1 (BACE1) Beta-site amyloid precursor protein cleaving enzyme 1 Memapsin-2 beta-Secretase (BACE-1) | beta-Secretase (BACE1)
Type:
Protein
Mol. Mass.:
55755.10
Organism:
Homo sapiens (Human)
Description:
P56817
Residue:
501
  
Inhibitor
Name:
BDBM50196731
Synonyms:
CHEMBL231669 | N-{(S)-2-(butane-1-sulfonyl)-1-[(1S,2R)-1-(3,5-difluoro-benzyl)-3-(3-ethyl-benzylamino)-2-hydroxy-propylcarbamoyl]-ethyl}-isobutyramide
Type:
Small organic molecule
Emp. Form.:
C30H41F2N3O5S
Mol. Mass.:
593.725
SMILES:
CCCCS(=O)(=O)C[C@@H](NC(=O)C1CC1)C(=O)N[C@@H](Cc1cc(F)cc(F)c1)[C@H](O)CNCc1cccc(CC)c1
: