Target
Cathepsin B
Ligand
BDBM50196758
Substrate
Meas. Tech.
ChEMBL_440732 (CHEMBL889829)
IC50
205±n/a nM
Citation
 Freskos, JNFobian, YMBenson, TEMoon, JBBienkowski, MJBrown, DLEmmons, TLHeintz, RLaborde, AMcDonald, JJMischke, BVMolyneaux, JMMullins, PBBryan Prince, DPaddock, DJTomasselli, AGWinterrowd, G Design of potent inhibitors of human beta-secretase. Part 2. Bioorg Med Chem Lett 17:78-81 (2006)  
Target
Name:
Cathepsin B
Synonyms:
APP secretase CATB_HUMAN CTSB Cathepsin B light chain | Cathepsin B1
Type:
Enzyme
Mol. Mass.:
37819.69
Organism:
Homo sapiens (Human)
Description:
gi_63102437
Residue:
339
  
Inhibitor
Name:
BDBM50196758
Synonyms:
2-cyanoethyl 1-((2S,3R)-4-(3-ethylbenzylamino)-1-(3,5-difluorophenyl)-3-hydroxybutan-2-ylamino)-3-(butylsulfonyl)-1-oxopropan-2-ylcarbamate | CHEMBL231864
Type:
Small organic molecule
Emp. Form.:
C30H40F2N4O6S
Mol. Mass.:
622.724
SMILES:
CCCCS(=O)(=O)CC(NC(=O)OCCC#N)C(=O)N[C@@H](Cc1cc(F)cc(F)c1)[C@H](O)CNCc1cccc(CC)c1
: