Target
Sodium-dependent noradrenaline transporter
Ligand
BDBM50199593
Substrate
Meas. Tech.
ChEMBL_453471 (CHEMBL885470)
Ki
118±n/a nM
Citation
 Letavic, MAKeith, JMJablonowski, JAStocking, EMGomez, LALy, KSMiller, JMBarbier, AJBonaventure, PBoggs, JDWilson, SJMiller, KLLord, BMcAllister, HMTognarelli, DJWu, JAbad, MCSchubert, CLovenberg, TWCarruthers, NI Novel tetrahydroisoquinolines are histamine H3 antagonists and serotonin reuptake inhibitors. Bioorg Med Chem Lett 17:1047-51 (2007)  
Target
Name:
Sodium-dependent noradrenaline transporter
Synonyms:
Monoamine transporter NET Noradrenaline Transporter (NET) Norepinephrine transporter protein (NET) SLC6A2 Sodium-dependent noradrenaline transporter (NET) | Solute carrier family 6 member 2
Type:
Multi-pass membrane protein
Mol. Mass.:
69337.72
Organism:
Homo sapiens (Human)
Description:
P23975
Residue:
617
  
Inhibitor
Name:
BDBM50199593
Synonyms:
7-(3-(4-fluoropiperidin-1-yl)propoxy)-2-methyl-4-(4-(methylthio)phenyl)-1,2,3,4-tetrahydroisoquinoline | CHEMBL395368
Type:
Small organic molecule
Emp. Form.:
C25H33FN2OS
Mol. Mass.:
428.606
SMILES:
CSc1ccc(cc1)C1CN(C)Cc2cc(OCCCN3CCC(F)CC3)ccc12
: