Target
Histamine H3 receptor
Ligand
BDBM50199609
Substrate
Meas. Tech.
ChEMBL_453434 (CHEMBL885433)
Ki
18±n/a nM
Citation
 Letavic, MAKeith, JMJablonowski, JAStocking, EMGomez, LALy, KSMiller, JMBarbier, AJBonaventure, PBoggs, JDWilson, SJMiller, KLLord, BMcAllister, HMTognarelli, DJWu, JAbad, MCSchubert, CLovenberg, TWCarruthers, NI Novel tetrahydroisoquinolines are histamine H3 antagonists and serotonin reuptake inhibitors. Bioorg Med Chem Lett 17:1047-51 (2007)  
Target
Name:
Histamine H3 receptor
Synonyms:
G-protein coupled receptor 97 HH3R HRH3 Histamine H3 receptor (H3) Histamine receptor (H3 and H4)
Type:
G Protein-Coupled Receptor (GPCR)
Mol. Mass.:
48691.47
Organism:
Homo sapiens (Human)
Description:
Binding assays were using CHO cells stably expressing hH3R receptors.
Residue:
445
  
Inhibitor
Name:
BDBM50199609
Synonyms:
7-(3-(4-fluoropiperidin-1-yl)propoxy)-2-methyl-4-(4-(trifluoromethyl)phenyl)-1,2,3,4-tetrahydroisoquinoline | CHEMBL246542
Type:
Small organic molecule
Emp. Form.:
C25H30F4N2O
Mol. Mass.:
450.5121
SMILES:
CN1CC(c2ccc(cc2)C(F)(F)F)c2ccc(OCCCN3CCC(F)CC3)cc2C1
: