Target
Tyrosine-protein kinase CSK
Ligand
BDBM50200198
Substrate
Meas. Tech.
ChEMBL_422673 (CHEMBL913341)
IC50
3400±n/a nM
Citation
 Gu, XWang, YKumar, AYe, GParang, KSun, G Design and evaluation of hydroxamate derivatives as metal-mediated inhibitors of a protein tyrosine kinase. J Med Chem 49:7532-9 (2006)  
Target
Name:
Tyrosine-protein kinase CSK
Synonyms:
C-SRC kinase CSK Protein-tyrosine kinase CYL | Tyrosine Kinase CSK
Type:
Tyrosine-protein kinase
Mol. Mass.:
50707.30
Organism:
Homo sapiens (Human)
Description:
P41240
Residue:
450
  
Inhibitor
Name:
BDBM50200198
Synonyms:
(S)-2-amino-N-hydroxy-3-(4-hydroxy-3,5-diiodophenyl)propanamide | CHEMBL220044
Type:
Small organic molecule
Emp. Form.:
C9H10I2N2O3
Mol. Mass.:
447.9962
SMILES:
N[C@@H](Cc1cc(I)c(O)c(I)c1)C(=O)NO
: