Target
Melanin-concentrating hormone receptor 1
Ligand
BDBM50200792
Substrate
Meas. Tech.
ChEMBL_421069 (CHEMBL854906)
IC50
165±n/a nM
Citation
 Arienzo, RCramp, SDyke, HJLockey, PMNorman, DRoach, AGSmith, PWong, MWren, SP Quinazoline and benzimidazole MCH-1R antagonists. Bioorg Med Chem Lett 17:1403-7 (2007)  
Target
Name:
Melanin-concentrating hormone receptor 1
Synonyms:
G-protein coupled receptor 24 MCH receptor 1 MCH-R1 MCHR-1 MCHR1_HUMAN Melanin-Concentrating Hormone Receptor 1 (MCH1R) Melanin-concentrating hormone receptor 1 (MCH-1) Melanin-concentrating hormone receptor 1 (MCHR-1) SLC-1 Somatostatin receptor-like protein
Type:
G Protein-Coupled Receptor (GPCR)
Mol. Mass.:
45976.27
Organism:
Homo sapiens (Human)
Description:
Membranes from CHO-K1 cells stably expressing human MCH1R were used in assays.
Residue:
422
  
Inhibitor
Name:
BDBM50200792
Synonyms:
ADS-102891 N-(4-methyl-2-(pyrrolidin-1-yl)quinazolin-6-yl)-2-(4-(trifluoromethyl)phenoxy)acetamide
Type:
Small organic molecule
Emp. Form.:
C22H21F3N4O2
Mol. Mass.:
430.4229
SMILES:
Cc1nc(nc2ccc(NC(=O)COc3ccc(cc3)C(F)(F)F)cc12)N1CCCC1
: