Target
Mitogen-activated protein kinase 14
Ligand
BDBM15237
Substrate
Meas. Tech.
ChEMBL_428526 (CHEMBL919883)
IC50
160±n/a nM
Citation
 Peifer, CKinkel, KAbadleh, MSchollmeyer, DLaufer, S From five- to six-membered rings: 3,4-diarylquinolinone as lead for novel p38MAP kinase inhibitors. J Med Chem 50:1213-21 (2007)  
Target
Name:
Mitogen-activated protein kinase 14
Synonyms:
CSAID-binding protein CSBP1 CSPB1 MAP kinase 14 MAP kinase p38 alpha MAPK14 MK14_HUMAN Mitogen-activated protein kinase p38 alpha Stress-activated protein kinase 2a | p38 MAP kinase alpha/beta
Type:
Serine/threonine-protein kinase
Mol. Mass.:
41286.76
Organism:
Homo sapiens (Human)
Description:
Q16539
Residue:
360
  
Inhibitor
Name:
BDBM15237
Synonyms:
4-[1-(cyclopropylmethyl)-4-(4-fluorophenyl)-1H-imidazol-5-yl]pyridine PYRIDINYLIMIDAZOLE SB216995
Type:
Small organic molecule
Emp. Form.:
C18H16FN3
Mol. Mass.:
293.3381
SMILES:
Fc1ccc(cc1)-c1ncn(CC2CC2)c1-c1ccncc1
: