Target
C-C chemokine receptor type 2
Ligand
BDBM50212129
Substrate
Meas. Tech.
ChEMBL_438766 (CHEMBL889103)
IC50
147±n/a nM
Citation
 Butora, GJiao, RParsons, WHVicario, PPJin, HAyala, JMCascieri, MAYang, L 3-Amino-1-alkyl-cyclopentane carboxamides as small molecule antagonists of the human and murine CC chemokine receptor 2. Bioorg Med Chem Lett 17:3636-41 (2007)  
Target
Name:
C-C chemokine receptor type 2
Synonyms:
CCR2_MOUSE Cmkbr2
Type:
PROTEIN
Mol. Mass.:
42795.68
Organism:
Mus musculus
Description:
ChEMBL_1502265
Residue:
373
  
Inhibitor
Name:
BDBM50212129
Synonyms:
1-(cyclobutylmethyl)-N-{[3-fluoro-5-(trifluoromethyl)phenyl]methyl}-3-[(1S,5'R)-5'-methylspiro[indene-1,4'-piperidine]-1'-yl]cyclopentane-1-carboxamide | CHEMBL231142
Type:
Small organic molecule
Emp. Form.:
C33H38F4N2O
Mol. Mass.:
554.6612
SMILES:
C[C@H]1CN(CC[C@]11C=Cc2ccccc12)C1CCC(CC2CCC2)(C1)C(=O)NCc1cc(F)cc(c1)C(F)(F)F
: