Target
C-C chemokine receptor type 2
Ligand
BDBM50212145
Substrate
Meas. Tech.
ChEMBL_438766 (CHEMBL889103)
IC50
15±n/a nM
Citation
 Butora, GJiao, RParsons, WHVicario, PPJin, HAyala, JMCascieri, MAYang, L 3-Amino-1-alkyl-cyclopentane carboxamides as small molecule antagonists of the human and murine CC chemokine receptor 2. Bioorg Med Chem Lett 17:3636-41 (2007)  
Target
Name:
C-C chemokine receptor type 2
Synonyms:
CCR2_MOUSE Cmkbr2
Type:
PROTEIN
Mol. Mass.:
42795.68
Organism:
Mus musculus
Description:
ChEMBL_1502265
Residue:
373
  
Inhibitor
Name:
BDBM50212145
Synonyms:
(1S,3R)-N-{[3,5-bis(trifluoromethyl)phenyl]methyl}-3-[(1S,5'R)-5'-methylspiro[indene-1,4'-piperidine]-1'-yl]-1-(propan-2-yl)cyclopentane-1-carboxamide | CHEMBL230721
Type:
Small organic molecule
Emp. Form.:
C32H36F6N2O
Mol. Mass.:
578.6315
SMILES:
CC(C)[C@@]1(CC[C@H](C1)N1CC[C@]2(C=Cc3ccccc23)[C@@H](C)C1)C(=O)NCc1cc(cc(c1)C(F)(F)F)C(F)(F)F
: