Target
Cannabinoid receptor 2
Ligand
BDBM50063884
Substrate
Meas. Tech.
ChEMBL_459064 (CHEMBL925156)
Ki
0.86±n/a nM
Citation
 Durdagi, SKapou, AKourouli, TAndreou, TNikas, SPNahmias, VRPapahatjis, DPPapadopoulos, MGMavromoustakos, T The application of 3D-QSAR studies for novel cannabinoid ligands substituted at the C1' position of the alkyl side chain on the structural requirements for binding to cannabinoid receptors CB1 and CB2. J Med Chem 50:2875-85 (2007)  
Target
Name:
Cannabinoid receptor 2
Synonyms:
CANNABINOID CB2 CB2 CB2B CNR2_HUMAN Cannabinoid CB2 receptor Cannabinoid receptor 2 (CB2R) | hCB2
Type:
G Protein-Coupled Receptor (GPCR)
Mol. Mass.:
39690.94
Organism:
Homo sapiens (Human)
Description:
P34972
Residue:
360
  
Inhibitor
Name:
BDBM50063884
Synonyms:
(6aR,10aR)-3-(1-Hexyl-cyclopropyl)-6,6,9-trimethyl-6a,7,10,10a-tetrahydro-6H-benzo[c]chromen-1-ol CHEMBL19847
Type:
Small organic molecule
Emp. Form.:
C25H36O2
Mol. Mass.:
368.5521
SMILES:
CCCCCCC1(CC1)c1cc(O)c2[C@@H]3CC(C)=CC[C@H]3C(C)(C)Oc2c1
: