Target
Peroxisome proliferator-activated receptor delta
Ligand
BDBM50214898
Substrate
Meas. Tech.
ChEMBL_456359 (CHEMBL888370)
EC50
1800±n/a nM
Citation
 Yamazaki, YAbe, KToma, TNishikawa, MOzawa, HOkuda, AAraki, TOda, SInoue, KShibuya, KStaels, BFruchart, JC Design and synthesis of highly potent and selective human peroxisome proliferator-activated receptor alpha agonists. Bioorg Med Chem Lett 17:4689-93 (2007)  
Target
Name:
Peroxisome proliferator-activated receptor delta
Synonyms:
NR1C2 NUCI Nuclear receptor subfamily 1 group C member 2 PPAR-beta PPARD Peroxisome proliferator-activated receptor Peroxisome proliferator-activated receptor delta
Type:
Enzyme
Mol. Mass.:
49910.45
Organism:
Homo sapiens (Human)
Description:
Q03181
Residue:
441
  
Inhibitor
Name:
BDBM50214898
Synonyms:
(S)-2-(3-((benzo[d]oxazol-2-yl(3-(4-methoxyphenoxy)propyl)amino)methyl)phenoxy)butanoic acid | CHEMBL247952
Type:
Small organic molecule
Emp. Form.:
C28H30N2O6
Mol. Mass.:
490.5476
SMILES:
CC[C@H](Oc1cccc(CN(CCCOc2ccc(OC)cc2)c2nc3ccccc3o2)c1)C(O)=O
: