Target
Mast/stem cell growth factor receptor Kit
Ligand
BDBM50215783
Substrate
Meas. Tech.
ChEMBL_456549 (CHEMBL922915)
IC50
240±n/a nM
Citation
 Wickens, PKluender, HDixon, JBrennan, CAchebe, FBacchiocchi, ABankston, DBierer, DBrands, MBraun, DBrown, MSChuang, CYDumas, JEnyedy, IHofilena, GHong, ZHousley, TJones, BKhire, UKreiman, CKumarasinghe, ELowinger, TOtt-Morgan, RPerkins, LPhillips, BSchoenleber, RScott, WJSheeler, RRedman, ASun, XTaylor, IWang, LWilhelm, SZhang, XZhang, MSullivan, ECarter, CMiglarese, MLevy, J SAR of a novel 'Anthranilamide Like' series of VEGFR-2, multi protein kinase inhibitors for the treatment of cancer. Bioorg Med Chem Lett 17:4378-81 (2007)  
Target
Name:
Mast/stem cell growth factor receptor Kit
Synonyms:
CD117 antigen KIT Mast/stem cell growth factor receptor Kit (cKIT) Proto-oncogene tyrosine-protein kinase Kit Stem cell growth factor receptor Tyrosine-protein kinase Kit c-kit v-kit Hardy-Zuckerman 4 feline sarcoma viral oncogene homolog
Type:
Protein
Mol. Mass.:
109869.37
Organism:
Homo sapiens (Human)
Description:
P10721
Residue:
976
  
Inhibitor
Name:
BDBM50215783
Synonyms:
1-(4-((2-((2,2-difluorobenzo[d][1,3]dioxol-5-yl)carbamoyl)phenylamino)methyl)pyridin-2-yl)-3-(2,3-dihydro-1H-inden-5-yl)urea | CHEMBL399571
Type:
Small organic molecule
Emp. Form.:
C30H25F2N5O4
Mol. Mass.:
557.5474
SMILES:
FC1(F)Oc2ccc(NC(=O)c3ccccc3NCc3ccnc(NC(=O)Nc4ccc5CCCc5c4)c3)cc2O1
: