Target
NAD-dependent protein deacetylase sirtuin-1
Ligand
BDBM50216690
Substrate
Meas. Tech.
ChEMBL_437198 (CHEMBL906596)
IC50
>50000±n/a nM
Citation
 Outeiro, TFKontopoulos, EAltmann, SMKufareva, IStrathearn, KEAmore, AMVolk, CBMaxwell, MMRochet, JCMcLean, PJYoung, ABAbagyan, RFeany, MBHyman, BTKazantsev, AG Sirtuin 2 inhibitors rescue alpha-synuclein-mediated toxicity in models of Parkinson's disease. Science 317:516-9 (2007)  
Target
Name:
NAD-dependent protein deacetylase sirtuin-1
Synonyms:
NAD-Dependent Deacetylase Sirtuin-1 NAD-dependent protein deacetylase sirtuin-1 (SIRT1) SIR2-like protein 1 SIRT1 Sirtuin-1 (SIRT1) | hSIR2
Type:
Developmental protein; hydrolase
Mol. Mass.:
81626.66
Organism:
Homo sapiens (Human)
Description:
Residue:
747
  
Inhibitor
Name:
BDBM50216690
Synonyms:
2-cyano-3-(5-(2,3-dichlorophenyl)furan-2-yl)-N-(quinolin-8-yl)acrylamide | CHEMBL226027
Type:
Small organic molecule
Emp. Form.:
C23H13Cl2N3O2
Mol. Mass.:
434.274
SMILES:
Clc1cccc(-c2ccc(\C=C(/C#N)C(=O)Nc3cccc4cccnc34)o2)c1Cl
: