Target
Peroxisome proliferator-activated receptor gamma
Ligand
BDBM50217878
Substrate
Meas. Tech.
ChEMBL_456953 (CHEMBL924315)
EC50
30±n/a nM
Citation
 Ahn, JHShin, MSJung, SHKim, JAKim, HMKim, SHKang, SKKim, KRRhee, SDPark, SDLee, JMLee, JHCheon, HGKim, SS Synthesis and structure-activity relationship of novel indene N-oxide derivatives as potent peroxisome proliferator activated receptor gamma (PPARgamma) agonists. Bioorg Med Chem Lett 17:5239-44 (2007)  
Target
Name:
Peroxisome proliferator-activated receptor gamma
Synonyms:
NR1C3 PPAR-gamma PPARG_HUMAN Peroxisome proliferator-activated receptor gamma (PPAR gamma) Peroxisome proliferator-activated receptor gamma (PPARĪ³) peroxisome proliferator-activated receptor gamma isoform 2
Type:
Nuclear Receptor
Mol. Mass.:
57613.46
Organism:
Homo sapiens (Human)
Description:
P37231
Residue:
505
  
Inhibitor
Name:
BDBM50217878
Synonyms:
CHEMBL401841 | ethyl 1-(methylnitroso)-6-[2-(4-methylpiperazin-1-yl)ethoxy]-3-phenyl-1H-indene-2-carboxylate
Type:
Small organic molecule
Emp. Form.:
C26H31N3O4
Mol. Mass.:
449.542
SMILES:
CCOC(=O)c1c(-c2ccccc2)c2ccc(OCCN3CCN(C)CC3)cc2[c-]1[N+](C)=O
: