Target
Retinoic acid receptor RXR-alpha
Ligand
BDBM50218498
Substrate
Meas. Tech.
ChEMBL_448792 (CHEMBL897938)
IC50
>10000±n/a nM
Citation
 Sakaki, JKonishi, KKishida, MGunji, HKanazawa, TUchiyama, HFukaya, HMitani, HKimura, M Synthesis and structure-activity relationship of RXR antagonists based on the diazepinylbenzoic acid structure. Bioorg Med Chem Lett 17:4808-11 (2007)  
Target
Name:
Retinoic acid receptor RXR-alpha
Synonyms:
NR2B1 Nuclear receptor subfamily 4 group A member 2 RXRA Retinoic acid receptor RXR-alpha/gamma Retinoid receptor
Type:
PROTEIN
Mol. Mass.:
50820.38
Organism:
Homo sapiens (Human)
Description:
ChEMBL_1456363
Residue:
462
  
Inhibitor
Name:
BDBM50218498
Synonyms:
4-(2-benzylamino-5,7,7,10,10-pentamethyl-7,8,9,10-tetrahydro-5H-5,13-diaza-benzo[4,5]cyclohepta[1,2-b]naphthalen-12-yl)-benzoic acid | CHEMBL391160
Type:
Small organic molecule
Emp. Form.:
C36H37N3O2
Mol. Mass.:
543.6979
SMILES:
CN1c2ccc(NCc3ccccc3)cc2N=C(c2ccc(cc2)C(O)=O)c2cc3c(cc12)C(C)(C)CCC3(C)C
: