Target
Tyrosine-protein phosphatase non-receptor type 2
Ligand
BDBM50219565
Substrate
Meas. Tech.
ChEMBL_445833 (CHEMBL896127)
Ki
8±n/a nM
Citation
 Wilson, DPWan, ZKXu, WXKirincich, SJFollows, BCJoseph-McCarthy, DForeman, KMoretto, AWu, JZhu, MBinnun, EZhang, YLTam, MErbe, DVTobin, JXu, XLeung, LShilling, ATam, SYMansour, TSLee, J Structure-based optimization of protein tyrosine phosphatase 1B inhibitors: from the active site to the second phosphotyrosine binding site. J Med Chem 50:4681-98 (2007)  
Target
Name:
Tyrosine-protein phosphatase non-receptor type 2
Synonyms:
PTN2_HUMAN PTPT T-cell protein-tyrosine phosphatase TCPTP Tyrosine-protein phosphatase non-receptor type 2 (TC-PTP)
Type:
Protein
Mol. Mass.:
48481.80
Organism:
Homo sapiens (Human)
Description:
P17706
Residue:
415
  
Inhibitor
Name:
BDBM50219565
Synonyms:
4-bromo-3-(carboxymethoxy)-5-[3-({1-[(2,6-dimethylbenzyl)-sulfonyl]piperidin-4-yl}amino)phenyl]thiophene-2-carboxylic acid | CHEMBL230752
Type:
Small organic molecule
Emp. Form.:
C27H29BrN2O7S2
Mol. Mass.:
637.562
SMILES:
Cc1cccc(C)c1CS(=O)(=O)N1CCC(CC1)Nc1cccc(c1)-c1sc(C(O)=O)c(OCC(O)=O)c1Br
: