Target
Histone deacetylase 6
Ligand
BDBM50222728
Substrate
Meas. Tech.
ChEMBL_457995 (CHEMBL925326)
IC50
8.8±n/a nM
Citation
 Shivashimpi, GMAmagai, SKato, TNishino, NMaeda, SNishino, TGYoshida, M Molecular design of histone deacetylase inhibitors by aromatic ring shifting in chlamydocin framework. Bioorg Med Chem 15:7830-9 (2007)  
Target
Name:
Histone deacetylase 6
Synonyms:
HD6 Hdac6 Histone deacetylase | Histone deacetylase mHDA2
Type:
PROTEIN
Mol. Mass.:
125762.28
Organism:
Mus musculus
Description:
ChEMBL_1460074
Residue:
1149
  
Inhibitor
Name:
BDBM50222728
Synonyms:
CHEMBL394261 | cyclo(-L-Am7(S2Py)-A2in-L-Ala-D-Pro-)
Type:
Small organic molecule
Emp. Form.:
C30H37N5O4S2
Mol. Mass.:
595.776
SMILES:
C[C@@H]1NC(=O)C2(Cc3ccccc3C2)NC(=O)[C@H](CCCCCSSc2ccccn2)NC(=O)[C@H]2CCCN2C1=O
: