Target
Beta-3 adrenergic receptor
Ligand
BDBM50224021
Substrate
Meas. Tech.
ChEMBL_458278 (CHEMBL924524)
EC50
6.5±n/a nM
Citation
 Stevens, FCBloomquist, WEBorel, AGCohen, MLDroste, CAHeiman, MLKriauciunas, ASall, DJTinsley, FCJesudason, CD Potent oxindole based human beta3 adrenergic receptor agonists. Bioorg Med Chem Lett 17:6270-3 (2007)  
Target
Name:
Beta-3 adrenergic receptor
Synonyms:
ADRB3_RAT Adrb3r Beta-3 adrenergic receptor
Type:
PROTEIN
Mol. Mass.:
43161.83
Organism:
Rattus norvegicus
Description:
ChEMBL_1509452
Residue:
400
  
Inhibitor
Name:
BDBM50224021
Synonyms:
(S)-6-(4-(2-(3-(3,3-dimethyl-2-oxoindolin-4-yloxy)-2-hydroxypropylamino)-2-methylpropyl)phenoxy)nicotinamide | CHEMBL251372
Type:
Small organic molecule
Emp. Form.:
C29H34N4O5
Mol. Mass.:
518.6041
SMILES:
CC(C)(Cc1ccc(Oc2ccc(cn2)C(N)=O)cc1)NC[C@H](O)COc1cccc2NC(=O)C(C)(C)c12
: