Target
Dipeptidyl peptidase 4
Ligand
BDBM50226076
Substrate
Meas. Tech.
ChEMBL_458753 (CHEMBL943037)
IC50
3.8±n/a nM
Citation
 Corbett, JWDirico, KSong, WBoscoe, BPDoran, SDBoyer, DQiu, XAmmirati, MVanvolkenburg, MAMcPherson, RKParker, JCCox, ED Design and synthesis of potent amido- and benzyl-substituted cis-3-amino-4-(2-cyanopyrrolidide)pyrrolidinyl DPP-IV inhibitors. Bioorg Med Chem Lett 17:6707-13 (2007)  
Target
Name:
Dipeptidyl peptidase 4
Synonyms:
ADABP Adenosine deaminase complexing protein 2 CD_antigen=CD26 DPP4 DPPIV Dipeptidyl peptidase 4 (DPP IV) Dipeptidyl peptidase 4 (DPP4) Dipeptidyl peptidase 4 membrane form Dipeptidyl peptidase IV Dipeptidyl peptidase IV (DDP-IV) Dipeptidyl peptidase IV membrane form Dipeptidyl peptidase-IV (DPP-4) T-cell activation antigen CD26 | TP103
Type:
Enzyme
Mol. Mass.:
88271.01
Organism:
Homo sapiens (Human)
Description:
P27487
Residue:
766
  
Inhibitor
Name:
BDBM50226076
Synonyms:
(1R)-2-((3R,4R)-1-(2-methyl-4-(1H-1,2,4-triazol-1-yl)benzyl)-3-aminopyrrolidine-4-carbonyl)cyclopentanecarbonitrile | CHEMBL250620
Type:
Small organic molecule
Emp. Form.:
C21H26N6O
Mol. Mass.:
378.4707
SMILES:
Cc1cc(ccc1CN1C[C@H](N)[C@@H](C1)C(=O)C1CCC[C@H]1C#N)-n1cncn1
: