Target
Cannabinoid receptor 1
Ligand
BDBM50234380
Substrate
Meas. Tech.
ChEMBL_462577 (CHEMBL928503)
Ki
3±n/a nM
Citation
 Ermann, MRiether, DWalker, ERMushi, IFJenkins, JENoya-Marino, BBrewer, MLTaylor, MGAmouzegh, PEast, SPDymock, BWGemkow, MJKahrs, AFEbneth, ALöbbe, SO'Shea, KShih, DTThomson, D Arylsulfonamide CB2 receptor agonists: SAR and optimization of CB2 selectivity. Bioorg Med Chem Lett 18:1725-9 (2008)  
Target
Name:
Cannabinoid receptor 1
Synonyms:
CANN6 CB-R CNR CNR1_HUMAN Cannabinoid receptor Cannabinoid receptor 1 (brain)
Type:
G Protein-Coupled Receptor (GPCR)
Mol. Mass.:
52868.96
Organism:
Homo sapiens (Human)
Description:
P21554
Residue:
472
  
Inhibitor
Name:
BDBM50234380
Synonyms:
CHEMBL245876 | quinolin-8-yl 4-methyl-3-(piperidin-1-ylsulfonyl)benzoate
Type:
Small organic molecule
Emp. Form.:
C22H22N2O4S
Mol. Mass.:
410.486
SMILES:
Cc1ccc(cc1S(=O)(=O)N1CCCCC1)C(=O)Oc1cccc2cccnc12
: