Target
Mitogen-activated protein kinase 11
Ligand
BDBM50236473
Substrate
Meas. Tech.
ChEMBL_463058 (CHEMBL928968)
IC50
1.5±n/a nM
Citation
 Hynes, JWu, HPitt, SShen, DRZhang, RSchieven, GLGillooly, KMShuster, DJTaylor, TLYang, XMcIntyre, KWMcKinnon, MZhang, HMarathe, PHDoweyko, AMKish, KKiefer, SESack, JSNewitt, JABarrish, JCDodd, JLeftheris, K The discovery of (R)-2-(sec-butylamino)-N-(2-methyl-5-(methylcarbamoyl)phenyl) thiazole-5-carboxamide (BMS-640994)-A potent and efficacious p38alpha MAP kinase inhibitor. Bioorg Med Chem Lett 18:1762-7 (2008)  
Target
Name:
Mitogen-activated protein kinase 11
Synonyms:
MAP kinase p38 MK11_HUMAN Mitogen-activated protein kinase p38 beta SAPK2 Stress-activated protein kinase 2 p38-2 p38b
Type:
Enzyme Catalytic Domain
Mol. Mass.:
41351.73
Organism:
Homo sapiens (Human)
Description:
gi_20128774
Residue:
364
  
Inhibitor
Name:
BDBM50236473
Synonyms:
(R)-2-(sec-butylamino)-N-(2-methyl-5-(methylcarbamoyl)phenyl)thiazole-5-carboxamide CHEMBL258202 | N-[2-methyl-5-(methylcarbamoyl)phenyl]-2-{[(1R)-1-methylpropyl]amino}-1,3-thiazole-5-carboxamide
Type:
Small organic molecule
Emp. Form.:
C17H22N4O2S
Mol. Mass.:
346.447
SMILES:
CC[C@@H](C)Nc1ncc(s1)C(=O)Nc1cc(ccc1C)C(=O)NC
: