Target
ATP-dependent 6-phosphofructokinase
Ligand
BDBM50270351
Substrate
Meas. Tech.
ChEMBL_530309 (CHEMBL980371)
IC50
80000±n/a nM
Citation
 Nowicki, MWTulloch, LBWorralll, LMcNae, IWHannaert, VMichels, PAFothergill-Gilmore, LAWalkinshaw, MDTurner, NJ Design, synthesis and trypanocidal activity of lead compounds based on inhibitors of parasite glycolysis. Bioorg Med Chem 16:5050-61 (2008)  
Target
Name:
ATP-dependent 6-phosphofructokinase
Synonyms:
6-phospho-1-fructokinase pfk
Type:
PROTEIN
Mol. Mass.:
53537.94
Organism:
Trypanosoma brucei
Description:
ChEMBL_1288121
Residue:
487
  
Inhibitor
Name:
BDBM50270351
Synonyms:
(2S,3S,4S,5R)-5-((3,4-dichlorobenzylamino)methyl)-N-cycloheptyl-3,4-dihydroxy-tetrahydrofuran-2-carboxamide | CHEMBL479202
Type:
Small organic molecule
Emp. Form.:
C20H28Cl2N2O4
Mol. Mass.:
431.353
SMILES:
O[C@H]1[C@H](O)[C@H](O[C@@H]1CNCc1ccc(Cl)c(Cl)c1)C(=O)NC1CCCCCC1
: