Target
11-beta-hydroxysteroid dehydrogenase type 2
Ligand
BDBM50260749
Substrate
Meas. Tech.
ChEMBL_552256 (CHEMBL995586)
IC50
>4000±n/a nM
Citation
 Zhu, YOlson, SHHermanowski-Vosatka, AMundt, SShah, KSpringer, MThieringer, RWright, SXiao, JZokian, HBalkovec, JM 4-Methyl-5-phenyl triazoles as selective inhibitors of 11beta-hydroxysteroid dehydrogenase type I. Bioorg Med Chem Lett 18:3405-11 (2008)  
Target
Name:
11-beta-hydroxysteroid dehydrogenase type 2
Synonyms:
11-DH2 11-beta-Hydroxysteroid Dehydrogenase 2 (11-beta-HSD2) 11-beta-hydroxysteroid dehydrogenase 2 11-beta-hydroxysteroid dehydrogenase type 2 (11-beta-HSD2) DHI2_HUMAN HSD11K SDR9C3
Type:
Enzyme
Mol. Mass.:
44141.72
Organism:
Homo sapiens (Human)
Description:
Purified recombinant human 11beta-HSD2.
Residue:
405
  
Inhibitor
Name:
BDBM50260749
Synonyms:
3-(1-(4-chlorophenyl)cyclobutyl)-5-(2-methoxyphenyl)-4-methyl-4H-1,2,4-triazole | CHEMBL525003
Type:
Small organic molecule
Emp. Form.:
C20H20ClN3O
Mol. Mass.:
353.845
SMILES:
COc1ccccc1-c1nnc(n1C)C1(CCC1)c1ccc(Cl)cc1
: