Target
Nociceptin receptor
Ligand
BDBM50239749
Substrate
Meas. Tech.
ChEMBL_556066 (CHEMBL953419)
IC50
0.660000±n/a nM
Citation
 Okamoto, OKobayashi, KKawamoto, HIto, SYoshizumi, TYamamoto, IHashimoto, MShimizu, ATakahashi, HIshii, YOzaki, SOhta, H Novel ORL1-selective antagonists with oral bioavailability and brain penetrability. Bioorg Med Chem Lett 18:3282-5 (2008)  
Target
Name:
Nociceptin receptor
Synonyms:
KOR-3 Mu-type opioid receptor (Mu) Nociceptin Receptor (ORL1 Receptor) Nociceptin receptor (ORL-1) Nociceptin/Orphanin FQ, NOP receptor OPIATE ORL-1 OPRL1 protein ORL1 Opioid receptor like-1 Orphanin FQ receptor (ORL1) | P41146
Type:
G Protein-Coupled Receptor (GPCR)
Mol. Mass.:
40702.87
Organism:
Homo sapiens (Human)
Description:
P41146
Residue:
370
  
Inhibitor
Name:
BDBM50239749
Synonyms:
2-(4-(6-chloro-2-(3-methylpentan-3-ylthio)-3H-benzo[d]imidazol-5-yl)piperazin-1-yl)ethanol CHEMBL263918
Type:
Small organic molecule
Emp. Form.:
C19H29ClN4OS
Mol. Mass.:
396.978
SMILES:
CCC(C)(CC)Sc1nc2cc(Cl)c(cc2[nH]1)N1CCN(CCO)CC1
: