Target
Nitric oxide synthase, brain
Ligand
BDBM50271363
Substrate
Meas. Tech.
ChEMBL_552452 (CHEMBL1002712)
Ki
11±n/a nM
Citation
 Castaño, TEncinas, APérez, CCastro, ACampillo, NEGil, C Design, synthesis, and evaluation of potential inhibitors of nitric oxide synthase. Bioorg Med Chem 16:6193-206 (2008)  
Target
Name:
Nitric oxide synthase, brain
Synonyms:
Constitutive NOS NC-NOS NOS type I nNOS NOS1_HUMAN Neuronal nitric oxide synthase Nitric oxide synthase, neuronal (nNOS) bNOS | nNOS
Type:
Homodimer
Mol. Mass.:
160985.98
Organism:
Homo sapiens (Human)
Description:
P29475
Residue:
1434
  
Inhibitor
Name:
BDBM50271363
Synonyms:
CHEMBL476988 | N-(3-Aminomethyl-phenyl)-2-methylsulfanyl-acetamidine
Type:
Small organic molecule
Emp. Form.:
C10H15N3S
Mol. Mass.:
209.311
SMILES:
CSCC(=N)Nc1cccc(CN)c1
: