Target
Kappa-type opioid receptor
Ligand
BDBM50243920
Substrate
Meas. Tech.
ChEMBL_555222 (CHEMBL965359)
EC50
0.1±n/a nM
Citation
 McAtee, JJDodson, JWDowdell, SEErhard, KGirard, GRGoodman, KBHilfiker, MAJin, JSehon, CASha, DShi, DWang, FWang, GZWang, NWang, YViet, AQYuan, CCZhang, DAiyar, NVBehm, DJCarballo, LHEvans, CAFries, HENagilla, RRoethke, TJXu, XDouglas, SANeeb, MJ Potent and selective small-molecule human urotensin-II antagonists with improved pharmacokinetic profiles. Bioorg Med Chem Lett 18:3716-9 (2008)  
Target
Name:
Kappa-type opioid receptor
Synonyms:
K-OR-1 Kappa-opioid receptor (KOR) Kappa-type opioid receptor (KOR) OPIATE Kappa OPRK1 kappa opioid receptor (KOR)
Type:
G Protein-Coupled Receptor (GPCR)
Mol. Mass.:
42648.76
Organism:
Homo sapiens (Human)
Description:
P41145
Residue:
380
  
Inhibitor
Name:
BDBM50243920
Synonyms:
(S)-2-((3,4-dichlorophenyl)(methyl)amino)-N-methyl-N-(1-phenyl-2-(pyrrolidin-1-yl)ethyl)acetamide | CHEMBL488635
Type:
Small organic molecule
Emp. Form.:
C22H27Cl2N3O
Mol. Mass.:
420.375
SMILES:
CN(CC(=O)N(C)[C@H](CN1CCCC1)c1ccccc1)c1ccc(Cl)c(Cl)c1
: