Target
Peroxisome proliferator-activated receptor alpha
Ligand
BDBM50256109
Substrate
Meas. Tech.
ChEMBL_513557 (CHEMBL979053)
EC50
0.072±n/a nM
Citation
 Pingali, HJain, MShah, SMakadia, PZaware, PGoel, APatel, MGiri, SPatel, HPatel, P Design and synthesis of novel oxazole containing 1,3-dioxane-2-carboxylic acid derivatives as PPAR alpha/gamma dual agonists. Bioorg Med Chem 16:7117-27 (2008)  
Target
Name:
Peroxisome proliferator-activated receptor alpha
Synonyms:
NR1C1 PPAR PPAR-alpha PPARA_HUMAN Peroxisome proliferator-activated receptor | Peroxisome proliferator-activated receptor alpha (PPAR alpha)
Type:
Enzyme
Mol. Mass.:
52222.08
Organism:
Homo sapiens (Human)
Description:
Q07869
Residue:
468
  
Inhibitor
Name:
BDBM50256109
Synonyms:
(2s,5s)-2-methyl-5-(4-((5-methyl-2-p-tolyloxazol-4-yl)methoxy)benzyl)-1,3-dioxane-2-carboxylic acid CHEMBL481551
Type:
Small organic molecule
Emp. Form.:
C25H27NO6
Mol. Mass.:
437.485
SMILES:
Cc1oc(nc1COc1ccc(C[C@H]2CO[C@](C)(OC2)C(O)=O)cc1)-c1ccc(C)cc1
: