Target
Substance-P receptor
Ligand
BDBM50262395
Substrate
Meas. Tech.
ChEMBL_514327 (CHEMBL967145)
IC50
0.9±n/a nM
Citation
 Shishido, YWakabayashi, HKoike, HUeno, NNukui, SYamagishi, TMurata, YNaganeo, FMizutani, MShimada, KFujiwara, YSakakibara, ASuga, OKusano, RUeda, SKanai, YTsuchiya, MSatake, K Discovery and stereoselective synthesis of the novel isochroman neurokinin-1 receptor antagonist 'CJ-17,493'. Bioorg Med Chem 16:7193-205 (2008)  
Target
Name:
Substance-P receptor
Synonyms:
NK-1 receptor NK1 Receptor NK1R_HUMAN Neurokinin-1 (NK-1) SPR TACR1 Tachykinin receptor 1 (NK1) | tachykinin
Type:
G Protein-Coupled Receptor (GPCR)
Mol. Mass.:
46254.43
Organism:
Homo sapiens (Human)
Description:
P25103
Residue:
407
  
Inhibitor
Name:
BDBM50262395
Synonyms:
CHEMBL478620 | R/S-(2S,3S)-N-((6-methoxy-3-(trifluoromethyl)-2,3-dihydro-1H-inden-5-yl)methyl)-2-phenylpiperidin-3-amine
Type:
Small organic molecule
Emp. Form.:
C23H27F3N2O
Mol. Mass.:
404.4685
SMILES:
COc1cc2CCC(c2cc1CN[C@H]1CCCN[C@H]1c1ccccc1)C(F)(F)F
: