Target
Protein kinase C alpha type
Ligand
BDBM50244690
Substrate
Meas. Tech.
ChEMBL_512395 (CHEMBL979906)
Ki
5.53±n/a nM
Citation
 Duan, DSigano, DMKelley, JALai, CCLewin, NEKedei, NPeach, MLLee, JAbeyweera, TPRotenberg, SAKim, HKim, YHEl Kazzouli, SChung, JUYoung, HAYoung, MRBaker, AColburn, NHHaimovitz-Friedman, ATruman, JPParrish, DADeschamps, JRPerry, NASurawski, RJBlumberg, PMMarquez, VE Conformationally constrained analogues of diacylglycerol. 29. Cells sort diacylglycerol-lactone chemical zip codes to produce diverse and selective biological activities. J Med Chem 51:5198-220 (2008)  
Target
Name:
Protein kinase C alpha type
Synonyms:
KPCA_MOUSE Prkca Protein kinase C alpha | Protein kinase C alpha type
Type:
Enzyme Catalytic Domain
Mol. Mass.:
76858.67
Organism:
MOUSE
Description:
Protein kinase C 0 MOUSE::P20444
Residue:
672
  
Inhibitor
Name:
BDBM50244690
Synonyms:
CHEMBL358095 rac-(E/Z)-(4-(4-fluorobenzylidene)-2-(hydroxymethyl)-5-oxo-tetrahydrofuran-2-yl)methyl 2-propylpentanoate
Type:
Small organic molecule
Emp. Form.:
C21H27FO5
Mol. Mass.:
378.4345
SMILES:
CCCC(CCC)C(=O)OCC1(CO)C\C(=C/c2ccc(F)cc2)C(=O)O1
: