Target
Fibroblast growth factor receptor 1
Ligand
BDBM50265773
Substrate
Meas. Tech.
ChEMBL_559889 (CHEMBL1010125)
IC50
1±n/a nM
Citation
 Renhowe, PAPecchi, SShafer, CMMachajewski, TDJazan, EMTaylor, CAntonios-McCrea, WMcBride, CMFrazier, KWiesmann, MLapointe, GRFeucht, PHWarne, RLHeise, CCMenezes, DAardalen, KYe, HHe, MLe, VVora, JJansen, JMWernette-Hammond, MEHarris, AL Design, structure-activity relationships and in vivo characterization of 4-amino-3-benzimidazol-2-ylhydroquinolin-2-ones: a novel class of receptor tyrosine kinase inhibitors. J Med Chem 52:278-92 (2009)  
Target
Name:
Fibroblast growth factor receptor 1
Synonyms:
BFGFR Basic fibroblast growth factor receptor 1 (FGFR1) CEK FGFR-1 FGFR-1, (FL) FGFR1_HUMAN FLT2 Fibroblast growth factor receptor 1 (FGFR-1) Fms-like tyrosine kinase 2 N-sam bFGF-R | c-fgr
Type:
Receptor
Mol. Mass.:
91861.70
Organism:
Homo sapiens (Human)
Description:
P11362
Residue:
822
  
Inhibitor
Name:
BDBM50265773
Synonyms:
4-Amino-3-benzimidazol-2-yl-5-(4-methylpiperazinyl)hydroquinolin-2-one | CHEMBL498551
Type:
Small organic molecule
Emp. Form.:
C21H22N6O
Mol. Mass.:
374.439
SMILES:
CN1CCN(CC1)c1cccc2[nH]c(=O)c(-c3nc4ccccc4[nH]3)c(N)c12
: