Target
TGF-beta receptor type-1
Ligand
BDBM50255231
Substrate
Meas. Tech.
ChEMBL_516219 (CHEMBL985076)
Ki
7.2±n/a nM
Citation
 Bonafoux, DChuaqui, CBoriack-Sjodin, PAFitch, CHankins, GJosiah, SBlack, CHetu, GLing, LLee, WC 2-Aminoimidazoles inhibitors of TGF-beta receptor 1. Bioorg Med Chem Lett 19:912-6 (2009)  
Target
Name:
TGF-beta receptor type-1
Synonyms:
ALK-5 Activin A receptor type II-like protein kinase of 53kD SKR4 TGF-beta receptor type I TGFBR1 TGFR1_HUMAN Transforming growth factor-beta receptor type I
Type:
enzyme
Mol. Mass.:
55968.24
Organism:
Homo sapiens (Human)
Description:
P36897
Residue:
503
  
Inhibitor
Name:
BDBM50255231
Synonyms:
CHEMBL479262 | N-(4-(5-fluoro-6-methylpyridin-2-yl)-5-(quinoxalin-6-yl)-1H-imidazol-2-yl)-2-methoxyacetamide
Type:
Small organic molecule
Emp. Form.:
C20H17FN6O2
Mol. Mass.:
392.3864
SMILES:
COCC(=O)Nc1nc(c([nH]1)-c1ccc2nccnc2c1)-c1ccc(F)c(C)n1
: