Target
Epoxide hydrolase 1
Ligand
BDBM50268380
Substrate
Meas. Tech.
ChEMBL_523914 (CHEMBL1001507)
IC50
>100.0±n/a nM
Citation
 Shen, HCDing, FXWang, SXu, SChen, HSTong, XTong, VMitra, KKumar, SZhang, XChen, YZhou, GPai, LYAlonso-Galicia, MChen, XZhang, BTata, JRBerger, JPColletti, SL Discovery of spirocyclic secondary amine-derived tertiary ureas as highly potent, selective and bioavailable soluble epoxide hydrolase inhibitors. Bioorg Med Chem Lett 19:3398-404 (2009)  
Target
Name:
Epoxide hydrolase 1
Synonyms:
EPHX EPOX Epoxide hydrolase (HsEH) HYEP_HUMAN | Microsomal epoxide hydrolase
Type:
Protein
Mol. Mass.:
52954.28
Organism:
Homo sapiens (Human)
Description:
P07099
Residue:
455
  
Inhibitor
Name:
BDBM50268380
Synonyms:
(+/-)-4-oxo-N-((tans)-2-phenylcyclopropyl)spiro[chroman-2,4'-piperidine]-1'-carboxamide 4-oxo-N-((trans)-2-phenylcyclopropyl)spiro[chroman-2,4'-piperidine]-1'-carboxamide | CHEMBL496189
Type:
Small organic molecule
Emp. Form.:
C23H24N2O3
Mol. Mass.:
376.4483
SMILES:
O=C(N[C@H]1C[C@@H]1c1ccccc1)N1CCC2(CC1)CC(=O)c1ccccc1O2
: