Target
Stromelysin-1
Ligand
BDBM50031784
Substrate
Meas. Tech.
ChEBML_102092
Ki
28±n/a nM
Citation
 Wahl, RCPulvino, TAMathiowetz, AMGhose, AKJohnson, JSDelecki, DCook, ERGainor, JAGowravaram, MRTomczuk, BE Hydroxamate inhibitors of human gelatinase B (92 kDa) Bioorg Med Chem Lett 5:349-352 (1995)    Article 
Target
Name:
Stromelysin-1
Synonyms:
MMP-3 MMP3_HUMAN Matrix metalloproteinase 3 Matrix metalloproteinase-3 (MMP-3) SL-1 Stromelysin 1 | Transin-1
Type:
Enzyme
Mol. Mass.:
53973.13
Organism:
Homo sapiens (Human)
Description:
P08254
Residue:
477
  
Inhibitor
Name:
BDBM50031784
Synonyms:
(R)-N*4*-Hydroxy-N*1*-((S)-1-methylcarbamoyl-2-phenyl-ethyl)-2-(4-phenoxy-butyl)-succinamide CHEMBL410259
Type:
Small organic molecule
Emp. Form.:
C24H31N3O5
Mol. Mass.:
441.52
SMILES:
CNC(=O)[C@H](Cc1ccccc1)NC(=O)[C@H](CCCCOc1ccccc1)CC(=O)NO
: