Target
Gastrin/cholecystokinin type B receptor
Ligand
BDBM50290398
Substrate
Meas. Tech.
ChEBML_47824
IC50
0.087000±n/a nM
Citation
 Tabuchi, SIto, HSogabe, HKuno, MKatsumi, IYamamoto, NMitsui, HSatoh, Y Dual CCK-A and -B receptor antagonists (I) C9-methyl-1,4-benzodiazepines Bioorg Med Chem Lett 7:169-174 (1997)    Article 
Target
Name:
Gastrin/cholecystokinin type B receptor
Synonyms:
CCK-2 receptor CCK-BR CCKRB Cholecystokinin receptor GASR_HUMAN | Gastrin/cholecystokinin type B receptor
Type:
G Protein-Coupled Receptor (GPCR)
Mol. Mass.:
48445.79
Organism:
Homo sapiens (Human)
Description:
Stable expression of human CCK-2 receptors in HEK 293 cells.
Residue:
447
  
Inhibitor
Name:
BDBM50290398
Synonyms:
1-[1-[2-(3-Aza-bicyclo[3.2.2]non-3-yl)-2-oxo-ethyl]-5-(2-fluoro-phenyl)-2-oxo-2,3-dihydro-1H-benzo[e][1,4]diazepin-3-yl]-3-m-tolyl-urea FR-175985
Type:
Small organic molecule
Emp. Form.:
C33H34FN5O3
Mol. Mass.:
567.6532
SMILES:
Cc1cccc(NC(=O)NC2N=C(c3ccccc3F)c3ccccc3N(CC(=O)N3CC4CCC(CC4)C3)C2=O)c1
: