Target
Matrix metalloproteinase-9
Ligand
BDBM50290672
Substrate
Meas. Tech.
ChEBML_102116
IC50
90±n/a nM
Citation
 Baxter, ADBhogal, RBird, JBBuckley, GMGregory, DSHedger, PCManallack, DTMassil, TMinton, KJMontana, JGNeidle, SOwen, DAWatson, RJ Mercaptoacyl matrix metalloproteinase inhibitors: The effect of substitution at the mercaptoacyl moiety Bioorg Med Chem Lett 7:2765-2770 (1997)    Article 
Target
Name:
Matrix metalloproteinase-9
Synonyms:
67 kDa matrix metalloproteinase-9 92 kDa gelatinase CLG4B Gelatinase B MMP9 Matrix metalloproteinase 9 (MMP-9) Matrix metalloproteinase-9 (MMP9)
Type:
Enzyme
Mol. Mass.:
78452.28
Organism:
Homo sapiens (Human)
Description:
P14780
Residue:
707
  
Inhibitor
Name:
BDBM50290672
Synonyms:
(S)-2-(2-Mercapto-acetylamino)-4-methyl-pentanoic acid ((S)-1-methylcarbamoyl-2-phenyl-ethyl)-amide | CHEMBL329145
Type:
Small organic molecule
Emp. Form.:
C18H27N3O3S
Mol. Mass.:
365.49
SMILES:
CNC(=O)[C@H](Cc1ccccc1)NC(=O)[C@H](CC(C)C)NC(=O)CS
: