Target
Sodium-dependent dopamine transporter
Ligand
BDBM50293604
Substrate
Meas. Tech.
ChEMBL_571436 (CHEMBL1032747)
IC50
175±n/a nM
Citation
 Lapinsky, DJAggarwal, SHuang, YSurratt, CKLever, JRFoster, JDVaughan, RA A novel photoaffinity ligand for the dopamine transporter based on pyrovalerone. Bioorg Med Chem 17:3770-4 (2009)  
Target
Name:
Sodium-dependent dopamine transporter
Synonyms:
DA transporter DAT1 Dopamine transporter protein (DAT) SC6A3_HUMAN Sodium-dependent dopamine transporter Solute carrier family 6 member 3
Type:
Multi-pass membrane protein
Mol. Mass.:
68497.11
Organism:
Homo sapiens (Human)
Description:
Q01959
Residue:
620
  
Inhibitor
Name:
BDBM50293604
Synonyms:
1-(4-amino-3-iodophenyl)-2-pyrrolidin-1-yl-pentan-1-one | CHEMBL553937
Type:
Small organic molecule
Emp. Form.:
C15H21IN2O
Mol. Mass.:
372.2445
SMILES:
CCCC(N1CCCC1)C(=O)c1ccc(N)c(I)c1
: